Target
G-protein coupled receptor 35
Ligand
BDBM68314
Substrate
Meas. Tech.
SAR analysis of Agonists of the GPR35 Receptor using an Image-Based Assay - Set 3
EC50
>32000±n/a nM
Citation
 PubChem, PC SAR analysis of Agonists of the GPR35 Receptor using an Image-Based Assay - Set 3 PubChem Bioassay (2010)[AID] 
Target
Name:
G-protein coupled receptor 35
Synonyms:
G protein-coupled receptor 35 GPR35_HUMAN
Type:
Enzyme Catalytic Domain
Mol. Mass.:
34085.57
Organism:
Homo sapiens (Human)
Description:
gi_33695097
Residue:
309
  
Inhibitor
Name:
BDBM68314
Synonyms:
MLS-0435540.0001 [4-(2-methylphenyl)piperazin-1-yl]-(5-piperidin-1-ylsulfonyl-2-pyrrolidin-1-yl-phenyl)methanone [4-(o-tolyl)piperazino]-(5-piperidinosulfonyl-2-pyrrolidino-phenyl)methanone | cid_17563969
Type:
Small organic molecule
Emp. Form.:
C27H36N4O3S
Mol. Mass.:
496.665
SMILES:
Cc1ccccc1N1CCN(CC1)C(=O)c1cc(ccc1N1CCCC1)S(=O)(=O)N1CCCCC1
: