Target
Cannabinoid receptor 2
Ligand
BDBM68308
Substrate
Meas. Tech.
SAR analysis of agonists of the Cannabinoid Receptor 2 using an Image-Based Assay - Set 2
EC50
>32000±n/a nM
Citation
 PubChem, PC SAR analysis of agonists of the Cannabinoid Receptor 2 using an Image-Based Assay - Set 2 PubChem Bioassay (2010)[AID] 
Target
Name:
Cannabinoid receptor 2
Synonyms:
CANNABINOID CB2 CB2 CB2B CNR2_HUMAN Cannabinoid CB2 receptor Cannabinoid receptor 2 (CB2R) | hCB2
Type:
G Protein-Coupled Receptor (GPCR)
Mol. Mass.:
39690.94
Organism:
Homo sapiens (Human)
Description:
P34972
Residue:
360
  
Inhibitor
Name:
BDBM68308
Synonyms:
4-chloranyl-3-[4-(2,3-dimethylphenyl)piperazin-1-yl]carbonyl-N,N-dimethyl-benzenesulfonamide 4-chloro-3-[4-(2,3-dimethylphenyl)piperazine-1-carbonyl]-N,N-dimethylbenzenesulfonamide MLS-0435534.0001 | cid_16273006
Type:
Small organic molecule
Emp. Form.:
C21H26ClN3O3S
Mol. Mass.:
435.967
SMILES:
CN(C)S(=O)(=O)c1ccc(Cl)c(c1)C(=O)N1CCN(CC1)c1cccc(C)c1C
: