Target
Cannabinoid receptor 2
Ligand
BDBM68326
Substrate
Meas. Tech.
SAR analysis of agonists of the Cannabinoid Receptor 2 using an Image-Based Assay - Set 2
EC50
>32000±n/a nM
Citation
 PubChem, PC SAR analysis of agonists of the Cannabinoid Receptor 2 using an Image-Based Assay - Set 2 PubChem Bioassay (2010)[AID] 
Target
Name:
Cannabinoid receptor 2
Synonyms:
CANNABINOID CB2 CB2 CB2B CNR2_HUMAN Cannabinoid CB2 receptor Cannabinoid receptor 2 (CB2R) | hCB2
Type:
G Protein-Coupled Receptor (GPCR)
Mol. Mass.:
39690.94
Organism:
Homo sapiens (Human)
Description:
P34972
Residue:
360
  
Inhibitor
Name:
BDBM68326
Synonyms:
MLS-0435556.0001 | cid_1143390
Type:
Small organic molecule
Emp. Form.:
C23H17N5O3S2
Mol. Mass.:
475.543
SMILES:
Cc1cc2cc3OCOc3cc2n2c(SCC(=O)Nc3nc(cs3)-c3ccccc3)nnc12
: