Target
Cannabinoid receptor 1
Ligand
BDBM68294
Substrate
Meas. Tech.
SAR analysis of antagonists of the Cannabinoid Receptor 1 using an Image-Based Assay - Set 3
IC50
>32000±n/a nM
Citation
 PubChem, PC SAR analysis of antagonists of the Cannabinoid Receptor 1 using an Image-Based Assay - Set 3 PubChem Bioassay (2010)[AID] 
Target
Name:
Cannabinoid receptor 1
Synonyms:
CANN6 CB-R CNR CNR1_HUMAN Cannabinoid receptor Cannabinoid receptor 1 (brain)
Type:
G Protein-Coupled Receptor (GPCR)
Mol. Mass.:
52868.96
Organism:
Homo sapiens (Human)
Description:
P21554
Residue:
472
  
Inhibitor
Name:
BDBM68294
Synonyms:
4-(2-ketopyrrolidino)-N-(3-morpholinosulfonylphenyl)benzamide N-(3-morpholin-4-ylsulfonylphenyl)-4-(2-oxidanylidenepyrrolidin-1-yl)benzamide N-[3-(4-morpholinylsulfonyl)phenyl]-4-(2-oxo-1-pyrrolidinyl)benzamide | cid_4292126
Type:
Small organic molecule
Emp. Form.:
C21H23N3O5S
Mol. Mass.:
429.489
SMILES:
O=C(Nc1cccc(c1)S(=O)(=O)N1CCOCC1)c1ccc(cc1)N1CCCC1=O
: