Target
Cannabinoid receptor 1
Ligand
BDBM68305
Substrate
Meas. Tech.
SAR analysis of antagonists of the Cannabinoid Receptor 1 using an Image-Based Assay - Set 3
IC50
>32000±n/a nM
Citation
 PubChem, PC SAR analysis of antagonists of the Cannabinoid Receptor 1 using an Image-Based Assay - Set 3 PubChem Bioassay (2010)[AID] 
Target
Name:
Cannabinoid receptor 1
Synonyms:
CANN6 CB-R CNR CNR1_HUMAN Cannabinoid receptor Cannabinoid receptor 1 (brain)
Type:
G Protein-Coupled Receptor (GPCR)
Mol. Mass.:
52868.96
Organism:
Homo sapiens (Human)
Description:
P21554
Residue:
472
  
Inhibitor
Name:
BDBM68305
Synonyms:
2-[(5-methyl-[1,2,4]triazolo[4,3-a]quinolin-1-yl)thio]-N-[4-(p-tolyl)thiazol-2-yl]acetamide N-[4-(4-methylphenyl)-1,3-thiazol-2-yl]-2-[(5-methyl-[1,2,4]triazolo[4,3-a]quinolin-1-yl)sulfanyl]acetamide N-[4-(4-methylphenyl)-2-thiazolyl]-2-[(5-methyl-[1,2,4]triazolo[4,3-a]quinolin-1-yl)thio]acetamide | cid_16253428
Type:
Small organic molecule
Emp. Form.:
C23H19N5OS2
Mol. Mass.:
445.56
SMILES:
Cc1ccc(cc1)-c1csc(NC(=O)CSc2nnc3cc(C)c4ccccc4n23)n1
: