Target
Cannabinoid receptor 1
Ligand
BDBM68312
Substrate
Meas. Tech.
SAR analysis of antagonists of the Cannabinoid Receptor 1 using an Image-Based Assay - Set 3
IC50
>32000±n/a nM
Citation
 PubChem, PC SAR analysis of antagonists of the Cannabinoid Receptor 1 using an Image-Based Assay - Set 3 PubChem Bioassay (2010)[AID] 
Target
Name:
Cannabinoid receptor 1
Synonyms:
CANN6 CB-R CNR CNR1_HUMAN Cannabinoid receptor Cannabinoid receptor 1 (brain)
Type:
G Protein-Coupled Receptor (GPCR)
Mol. Mass.:
52868.96
Organism:
Homo sapiens (Human)
Description:
P21554
Residue:
472
  
Inhibitor
Name:
BDBM68312
Synonyms:
4-fluoranyl-N-(2-methoxy-5-morpholin-4-ylsulfonyl-phenyl)-3-methyl-1-benzothiophene-2-carboxamide 4-fluoro-N-(2-methoxy-5-morpholinosulfonyl-phenyl)-3-methyl-benzothiophene-2-carboxamide MLS-0435538.0001 | cid_16303023
Type:
Small organic molecule
Emp. Form.:
C21H21FN2O5S2
Mol. Mass.:
464.53
SMILES:
COc1ccc(cc1NC(=O)c1sc2cccc(F)c2c1C)S(=O)(=O)N1CCOCC1
: