Target
Cannabinoid receptor 1
Ligand
BDBM68329
Substrate
Meas. Tech.
SAR analysis of antagonists of the Cannabinoid Receptor 1 using an Image-Based Assay - Set 3
IC50
>32000±n/a nM
Citation
 PubChem, PC SAR analysis of antagonists of the Cannabinoid Receptor 1 using an Image-Based Assay - Set 3 PubChem Bioassay (2010)[AID] 
Target
Name:
Cannabinoid receptor 1
Synonyms:
CANN6 CB-R CNR CNR1_HUMAN Cannabinoid receptor Cannabinoid receptor 1 (brain)
Type:
G Protein-Coupled Receptor (GPCR)
Mol. Mass.:
52868.96
Organism:
Homo sapiens (Human)
Description:
P21554
Residue:
472
  
Inhibitor
Name:
BDBM68329
Synonyms:
4-chloranyl-N-(2-methoxy-5-morpholin-4-ylsulfonyl-phenyl)benzamide 4-chloro-N-(2-methoxy-5-morpholinosulfonyl-phenyl)benzamide MLS-0397235.0001 | cid_6484583
Type:
Small organic molecule
Emp. Form.:
C18H19ClN2O5S
Mol. Mass.:
410.872
SMILES:
COc1ccc(cc1NC(=O)c1ccc(Cl)cc1)S(=O)(=O)N1CCOCC1
: