Target
Protein LANA1
Ligand
BDBM74298
Substrate
Meas. Tech.
Fluorescence Polarization Cell-Free Homogeneous Dose Retest to Confirm Inhibitors of the LANA Histone H2A/H2B Interaction
EC50
>75000±n/a nM
Citation
 PubChem, PC Fluorescence Polarization Cell-Free Homogeneous Dose Retest to Confirm Inhibitors of the LANA Histone H2A/H2B Interaction PubChem Bioassay (2010)[AID] 
Target
Name:
Protein LANA1
Synonyms:
LANA LANA1_HHV8P
Type:
Enzyme Catalytic Domain
Mol. Mass.:
131093.36
Organism:
Human herpesvirus 8
Description:
Q9QR71
Residue:
1129
  
Inhibitor
Name:
BDBM74298
Synonyms:
MLS002182550 N-[2-(3,4-diethoxyanilino)-2-oxoethyl]-N,5,7-trimethyl-[1,2,4]triazolo[1,5-a]pyrimidine-2-carboxamide SMR001271580 | cid_25162440
Type:
Small organic molecule
Emp. Form.:
C21H26N6O4
Mol. Mass.:
426.4689
SMILES:
CCOc1ccc(NC(=O)CN(C)C(=O)c2nc3nc(C)cc(C)n3n2)cc1OCC
: