Target
Protein LANA1
Ligand
BDBM74327
Substrate
Meas. Tech.
Fluorescence Polarization Cell-Free Homogeneous Dose Retest to Confirm Inhibitors of the LANA Histone H2A/H2B Interaction
EC50
>75000±n/a nM
Citation
 PubChem, PC Fluorescence Polarization Cell-Free Homogeneous Dose Retest to Confirm Inhibitors of the LANA Histone H2A/H2B Interaction PubChem Bioassay (2010)[AID] 
Target
Name:
Protein LANA1
Synonyms:
LANA LANA1_HHV8P
Type:
Enzyme Catalytic Domain
Mol. Mass.:
131093.36
Organism:
Human herpesvirus 8
Description:
Q9QR71
Residue:
1129
  
Inhibitor
Name:
BDBM74327
Synonyms:
2,4-dimethylbenzoic acid [2-[(3-tert-butyl-5-isoxazolyl)amino]-2-oxoethyl] ester MLS002164823 [2-[(3-tert-butyl-1,2-oxazol-5-yl)amino]-2-oxidanylidene-ethyl] 2,4-dimethylbenzoate cid_9361441
Type:
Small organic molecule
Emp. Form.:
C18H22N2O4
Mol. Mass.:
330.3783
SMILES:
Cc1ccc(C(=O)OCC(=O)Nc2cc(no2)C(C)(C)C)c(C)c1
: