Target
Protein LANA1
Ligand
BDBM74328
Substrate
Meas. Tech.
Fluorescence Polarization Cell-Free Homogeneous Dose Retest to Confirm Inhibitors of the LANA Histone H2A/H2B Interaction
EC50
>75000±n/a nM
Citation
 PubChem, PC Fluorescence Polarization Cell-Free Homogeneous Dose Retest to Confirm Inhibitors of the LANA Histone H2A/H2B Interaction PubChem Bioassay (2010)[AID] 
Target
Name:
Protein LANA1
Synonyms:
LANA LANA1_HHV8P
Type:
Enzyme Catalytic Domain
Mol. Mass.:
131093.36
Organism:
Human herpesvirus 8
Description:
Q9QR71
Residue:
1129
  
Inhibitor
Name:
BDBM74328
Synonyms:
6-amino-1-cyclopropyl-5-[2-[(5-esyl-1,3-benzoxazol-2-yl)thio]acetyl]pyrimidine-2,4-quinone 6-amino-1-cyclopropyl-5-[2-[(5-ethylsulfonyl-1,3-benzoxazol-2-yl)thio]-1-oxoethyl]pyrimidine-2,4-dione MLS002161347 cid_16296270
Type:
Small organic molecule
Emp. Form.:
C18H18N4O6S2
Mol. Mass.:
450.489
SMILES:
CCS(=O)(=O)c1ccc2oc(SCC(=O)c3c(N)n(C4CC4)c(=O)[nH]c3=O)nc2c1
: