Target
cAMP-dependent protein kinase catalytic subunit alpha
Ligand
BDBM2610
Substrate
histone (type Vs)
Meas. Tech.
PKA assay
IC50
14000±n/a nM
Citation
 Davis, PDHill, CHLawton, GNixon, JSWilkinson, SEHurst, SAKeech, ETurner, SE Inhibitors of protein kinase C. 1. 2,3-Bisarylmaleimides. J Med Chem 35:177-84 (1992)  
Target
Name:
cAMP-dependent protein kinase catalytic subunit alpha
Synonyms:
KAPCA_BOVIN PKC Protein Kinase C cAMP-Dependent Protein Kinase (PKA) cAMP-dependent protein kinase A cAMP-dependent protein kinase, alpha-catalytic subunit
Type:
Enzyme Complex
Mol. Mass.:
40627.77
Organism:
Bos taurus (bovine)
Description:
The PKA holoenzyme purified from bovine heart, exists as an inactive tetrameric complex, which consists of a regulatory dimer associated with two catalytic subunits. It requires cAMP to activate the enzymatic reaction.
Residue:
351
  
Inhibitor
Name:
BDBM2610
Synonyms:
3-(5-Methoxy-1-methyl-3-indolyl)-4-(1-methyl-3-indolyl)pyrrole-2,5-dione Bisindolylmaleimide deriv. 32
Type:
Small organic molecule
Emp. Form.:
C23H19N3O3
Mol. Mass.:
385.4153
SMILES:
COc1ccc2n(C)cc(C3=C(C(=O)NC3=O)c3cn(C)c4ccccc34)c2c1
:
Substrate
Name:
histone (type Vs)
Synonyms:
Type:
Other Protein Type
Mol. Mass.:
358.43
Organism:
Description:
11 uM [gamma-32P]ATP as co-substrate.
Residue:
3
NA