Target
Protein kinase C beta type
Ligand
BDBM2656
Substrate
Lysine-rich histone
Meas. Tech.
PKC assay
IC50
2400±n/a nM
Citation
 Davis, PDHill, CHLawton, GNixon, JSWilkinson, SEHurst, SAKeech, ETurner, SE Inhibitors of protein kinase C. 1. 2,3-Bisarylmaleimides. J Med Chem 35:177-84 (1992)  
Target
Name:
Protein kinase C beta type
Synonyms:
KPCB_RAT Pkcb Prkcb1 Protein kinase C (PKC) | Protein kinase C beta
Type:
Enzyme Mixture
Mol. Mass.:
76755.54
Organism:
Rattus norvegicus (rat)
Description:
PKC from rat brain is known to contain predominately the conventional PKC isoforms, alpha, beta I, beta II, gamma.
Residue:
671
  
Inhibitor
Name:
BDBM2656
Synonyms:
(Phenylindolyl)maleimide deriv. 78 | 3-(2,6-dichlorophenyl)-4-(1-methyl-1H-indol-3-yl)-2,5-dihydro-1H-pyrrole-2,5-dione
Type:
Small organic molecule
Emp. Form.:
C19H12Cl2N2O2
Mol. Mass.:
371.217
SMILES:
Cn1cc(C2=C(C(=O)NC2=O)c2c(Cl)cccc2Cl)c2ccccc12
:
Substrate
Name:
Lysine-rich histone
Synonyms:
ING Peptide histone type IIIS
Type:
Peptide
Mol. Mass.:
10508.21
Organism:
Bos taurus (bovine)
Description:
Purified as a lysine rich fraction of histone H1 from calf thymus.
Residue:
105