Target
Nuclear receptor subfamily 1 group I member 2
Ligand
BDBM75497
Substrate
Meas. Tech.
Luminescence-based counterscreen for activators of the Aryl Hydrocarbon Receptor (AHR): cell-based high throughput dose response screening assay for activators of the Pregnane X Receptor (PXR)
EC50
>116135±n/a nM
Citation
 PubChem, PC Luminescence-based counterscreen for activators of the Aryl Hydrocarbon Receptor (AHR): cell-based high throughput dose response screening assay for activators of the Pregnane X Receptor (PXR) PubChem Bioassay (2010)[AID] 
Target
Name:
Nuclear receptor subfamily 1 group I member 2
Synonyms:
NR1I2 Orphan nuclear receptor PAR1 PXR SXR nuclear receptor subfamily 1 group I member 2 isoform 1
Type:
Nuclear receptor
Mol. Mass.:
49774.77
Organism:
Homo sapiens (Human)
Description:
O75469
Residue:
434
  
Inhibitor
Name:
BDBM75497
Synonyms:
MLS000684512 N-[2-chloranyl-4-(propanoylcarbamothioylamino)phenyl]furan-2-carboxamide N-[2-chloro-4-(propionylthiocarbamoylamino)phenyl]-2-furamide SMR000269696 | cid_1345009
Type:
Small organic molecule
Emp. Form.:
C15H14ClN3O3S
Mol. Mass.:
351.808
SMILES:
CCC(=O)NC(=S)Nc1ccc(NC(=O)c2ccco2)c(Cl)c1
: