Target
Phosphorylase b kinase regulatory subunit alpha, skeletal muscle isoform
Ligand
BDBM2694
Substrate
Phosphorylase b
Meas. Tech.
Phosphorylase Kinasse Assay
IC50
750±n/a nM
Citation
 Toullec, DPianetti, PCoste, HBellevergue, PGrand-Perret, TAjakane, MBaudet, VBoissin, PBoursier, ELoriolle, F The bisindolylmaleimide GF 109203X is a potent and selective inhibitor of protein kinase C. J Biol Chem 266:15771-81 (1991) Target
Name:
Phosphorylase b kinase regulatory subunit alpha, skeletal muscle isoform
Synonyms:
KPB1_RABIT Phosphorylase Kinase
Type:
Enzyme Complex
Mol. Mass.:
138403.25
Organism:
Oryctolagus cuniculus (rabbit)
Description:
The enzyme is a hexadecamer of four types of subunits:alpha(4)beta(4)gamma(4)delta(4) isolated from skeletal muscle of rabbits.
Residue:
1237
  
Inhibitor
Name:
BDBM2694
Synonyms:
3-(1H-indol-3-yl)-4-{1-[2-(1-methylpyrrolidin-2-yl)ethyl]-1H-indol-3-yl}-2,5-dihydro-1H-pyrrole-2,5-dione Bisindolyl deriv. 22 | CHEMBL218328
Type:
Small organic molecule
Emp. Form.:
C27H26N4O2
Mol. Mass.:
438.5209
SMILES:
CN1CCCC1CCn1cc(C2=C(C(=O)NC2=O)c2c[nH]c3ccccc23)c2ccccc12
:
Substrate
Name:
Phosphorylase b
Synonyms:
Type:
Peptide
Mol. Mass.:
1157.29
Organism:
Description:
250 uM [gamma-32P]ATP as co-substrate.
Residue:
12
ISVGLAGVENVT