Target
Caspase-7
Ligand
BDBM53108
Substrate
Meas. Tech.
Counterscreen for procaspase-3 activators: absorbance-based biochemical high throughput dose response assay for activators of procaspase-7
EC50
>85247±n/a nM
Citation
 PubChem, PC Counterscreen for procaspase-3 activators: absorbance-based biochemical high throughput dose response assay for activators of procaspase-7 PubChem Bioassay (2010)[AID] 
Target
Name:
Caspase-7
Synonyms:
Apoptotic protease Mch-3 CASP7 CMH-1 MCH3 | caspase 7, apoptosis-related cysteine peptidase
Type:
Enzyme
Mol. Mass.:
34273.91
Organism:
Homo sapiens (Human)
Description:
P55210
Residue:
303
  
Inhibitor
Name:
BDBM53108
Synonyms:
2-[(6,7-dihydroxy-2-keto-chromen-4-yl)methylamino]benzoic acid methyl ester MLS001214762 cid_5574594 methyl 2-[[6,7-bis(oxidanyl)-2-oxidanylidene-chromen-4-yl]methylamino]benzoate
Type:
Small organic molecule
Emp. Form.:
C18H15NO6
Mol. Mass.:
341.3148
SMILES:
COC(=O)c1ccccc1NCc1cc(=O)oc2cc(O)c(O)cc12
: