Target
DNA damage-inducible transcript 3 protein
Ligand
BDBM68196
Substrate
Meas. Tech.
CHOP dose-response primary assay
IC50
5490±n/a nM
Citation
 PubChem, PC CHOP dose-response primary assay PubChem Bioassay (2011)[AID] 
Target
Name:
DNA damage-inducible transcript 3 protein
Synonyms:
Chop DDIT3_MOUSE Gadd153
Type:
Enzyme Catalytic Domain
Mol. Mass.:
19175.17
Organism:
Mus musculus
Description:
gi_160707929
Residue:
168
  
Inhibitor
Name:
BDBM68196
Synonyms:
3-[4-[(4-fluorobenzyl)amino]-3-nitro-phenyl]-3-[[2-(1-naphthyl)acetyl]amino]propionamide 3-[4-[(4-fluorophenyl)methylamino]-3-nitrophenyl]-3-[(2-naphthalen-1-ylacetyl)amino]propanamide MLS000420599 cid_16746216
Type:
Small organic molecule
Emp. Form.:
C28H25FN4O4
Mol. Mass.:
500.5209
SMILES:
NC(=O)CC(NC(=O)Cc1cccc2ccccc12)c1ccc(NCc2ccc(F)cc2)c(c1)[N+]([O-])=O
: