Target
DNA damage-inducible transcript 3 protein
Ligand
BDBM61569
Substrate
Meas. Tech.
CHOP dose-response primary assay
IC50
>10000±n/a nM
Citation
 PubChem, PC CHOP dose-response primary assay PubChem Bioassay (2011)[AID] 
Target
Name:
DNA damage-inducible transcript 3 protein
Synonyms:
Chop DDIT3_MOUSE Gadd153
Type:
Enzyme Catalytic Domain
Mol. Mass.:
19175.17
Organism:
Mus musculus
Description:
gi_160707929
Residue:
168
  
Inhibitor
Name:
BDBM61569
Synonyms:
(2S)-2-[[4-[[4-[(tert-butoxycarbonylamino)methyl]phenyl]carbamoyl]-1H-imidazole-5-carbonyl]amino]propionic acid tert-butyl ester ILP-IV-66 SMR000465904 tert-butyl (2S)-2-[[4-[[4-[[(2-methylpropan-2-yl)oxycarbonylamino]methyl]phenyl]carbamoyl]-1H-imidazol-5-yl]carbonylamino]propanoate | tert-butyl (2S)-2-[[4-[[4-[[(2-methylpropan-2-yl)oxycarbonylamino]methyl]phenyl]carbamoyl]-1H-imidazole-5-carbonyl]amino]propanoate
Type:
Small organic molecule
Emp. Form.:
C24H33N5O6
Mol. Mass.:
487.5487
SMILES:
C[C@H](NC(=O)c1nc[nH]c1C(=O)Nc1ccc(CNC(=O)OC(C)(C)C)cc1)C(=O)OC(C)(C)C
: