Target
Epidermal growth factor receptor
Ligand
BDBM270587
Substrate
Meas. Tech.
High Throughput EGFR Biochemical Assay
pH
7±n/a
Temperature
298.15±n/a K
EC50
20.0±n/a nM
Comments
extracted
Citation
 Balan, GChou, CKim, MKirschberg, TALink, JOPhillips, GSaito, RDSquires, NHTaylor, JGWatkins, WJWright, NE Cot modulators and methods of use thereof US Patent  US10059695 Publication Date 8/28/2018 
Target
Name:
Epidermal growth factor receptor
Synonyms:
EGF Receptor Substrate EGFR_HUMAN ERBB1 Epidermal Growth Factor Receptor erbB-1 Epidermal growth factor receptor (EGFR) HER1 Proto-oncogene c-ErbB-1 Tyrosine-Protein Kinase ErbB-1
Type:
Receptor Kinase Domain
Mol. Mass.:
134279.59
Organism:
Homo sapiens (Human)
Description:
P00533
Residue:
1210
  
Inhibitor
Name:
BDBM270587
Synonyms:
(S)-6-(((2- chlorophenyl)(1- cyclopropyl-1H- 1,2,3-triazol-4- yl)methyl-d)amino)- 4- (neopentylamino) quinazoline-8- carbonitrile US10577352, Compound I-19
Type:
Small organic molecule
Emp. Form.:
C26H27ClN8
Mol. Mass.:
486.999
SMILES:
CC(C)(C)CNc1ncnc2c(cc(NC(c3cn(nn3)C3CC3)c3ccccc3Cl)cc12)C#N
: