Target
Hexokinase HKDC1 [W721R]
Ligand
BDBM34343
Substrate
Meas. Tech.
Dose Response confirmation of activators of hexokinase domain containing I (HKDC1)
EC50
>80000±n/a nM
Citation
 PubChem, PC Dose Response confirmation of activators of hexokinase domain containing I (HKDC1) PubChem Bioassay (2011)[AID] 
Target
Name:
Hexokinase HKDC1 [W721R]
Synonyms:
HKDC1 putative hexokinase HKDC1
Type:
Enzyme Catalytic Domain
Mol. Mass.:
102520.24
Organism:
Homo sapiens (Human)
Description:
gi_156151420
Residue:
917
  
Inhibitor
Name:
BDBM34343
Synonyms:
4-(6-ethylindolo[2,3-b]quinoxalin-2-yl)sulfonylmorpholine MLS000058610 cid_2545261
Type:
Small organic molecule
Emp. Form.:
C20H20N4O3S
Mol. Mass.:
396.463
SMILES:
CCn1c2ccccc2c2nc3cc(ccc3nc12)S(=O)(=O)N1CCOCC1
: