Target
Hexokinase HKDC1 [W721R]
Ligand
BDBM80779
Substrate
Meas. Tech.
Dose Response confirmation of activators of hexokinase domain containing I (HKDC1)
EC50
46700±n/a nM
Citation
 PubChem, PC Dose Response confirmation of activators of hexokinase domain containing I (HKDC1) PubChem Bioassay (2011)[AID] 
Target
Name:
Hexokinase HKDC1 [W721R]
Synonyms:
HKDC1 putative hexokinase HKDC1
Type:
Enzyme Catalytic Domain
Mol. Mass.:
102520.24
Organism:
Homo sapiens (Human)
Description:
gi_156151420
Residue:
917
  
Inhibitor
Name:
BDBM80779
Synonyms:
MLS000547762 N-[2-[(4-methyl-1,2,4-triazol-3-yl)sulfanyl]-1,2-dihydroacenaphthylen-1-yl]benzenesulfonamide N-[2-[(4-methyl-1,2,4-triazol-3-yl)thio]acenaphthen-1-yl]benzenesulfonamide cid_2913537
Type:
Small organic molecule
Emp. Form.:
C21H18N4O2S2
Mol. Mass.:
422.523
SMILES:
Cn1cnnc1SC1C(NS(=O)(=O)c2ccccc2)c2cccc3cccc1c23
: