Target
Hexokinase HKDC1 [W721R]
Ligand
BDBM80780
Substrate
Meas. Tech.
Dose Response confirmation of activators of hexokinase domain containing I (HKDC1)
EC50
39200±n/a nM
Citation
 PubChem, PC Dose Response confirmation of activators of hexokinase domain containing I (HKDC1) PubChem Bioassay (2011)[AID] 
Target
Name:
Hexokinase HKDC1 [W721R]
Synonyms:
HKDC1 putative hexokinase HKDC1
Type:
Enzyme Catalytic Domain
Mol. Mass.:
102520.24
Organism:
Homo sapiens (Human)
Description:
gi_156151420
Residue:
917
  
Inhibitor
Name:
BDBM80780
Synonyms:
4-Benzyl-7-fluoro-2-methyl-4H-thiazolo[5,4-b]indole 4-benzyl-7-fluoro-2-methyl-thiazol[5,4-b]indole 7-fluoro-2-methyl-4-(phenylmethyl)thiazolo[5,4-b]indole SMR000221581 | cid_2039005
Type:
Small organic molecule
Emp. Form.:
C17H13FN2S
Mol. Mass.:
296.362
SMILES:
Cc1nc2c(s1)n(Cc1ccccc1)c1ccc(F)cc21
: