Target
Hexokinase HKDC1 [W721R]
Ligand
BDBM80809
Substrate
Meas. Tech.
Dose Response confirmation of activators of hexokinase domain containing I (HKDC1)
EC50
14800±n/a nM
Citation
 PubChem, PC Dose Response confirmation of activators of hexokinase domain containing I (HKDC1) PubChem Bioassay (2011)[AID] 
Target
Name:
Hexokinase HKDC1 [W721R]
Synonyms:
HKDC1 putative hexokinase HKDC1
Type:
Enzyme Catalytic Domain
Mol. Mass.:
102520.24
Organism:
Homo sapiens (Human)
Description:
gi_156151420
Residue:
917
  
Inhibitor
Name:
BDBM80809
Synonyms:
3-[1-methyl-5-[(1-methyl-5-pyridin-3-yl-pyrrol-2-yl)disulfanyl]pyrrol-2-yl]pyridine 3-[1-methyl-5-[[1-methyl-5-(3-pyridinyl)-2-pyrrolyl]disulfanyl]-2-pyrrolyl]pyridine MLS002637680 cid_220466
Type:
Small organic molecule
Emp. Form.:
C20H18N4S2
Mol. Mass.:
378.514
SMILES:
Cn1c(SSc2ccc(-c3cccnc3)n2C)ccc1-c1cccnc1
: