Target
Hexokinase HKDC1 [W721R]
Ligand
BDBM80810
Substrate
Meas. Tech.
Dose Response confirmation of activators of hexokinase domain containing I (HKDC1)
EC50
>80000±n/a nM
Citation
 PubChem, PC Dose Response confirmation of activators of hexokinase domain containing I (HKDC1) PubChem Bioassay (2011)[AID] 
Target
Name:
Hexokinase HKDC1 [W721R]
Synonyms:
HKDC1 putative hexokinase HKDC1
Type:
Enzyme Catalytic Domain
Mol. Mass.:
102520.24
Organism:
Homo sapiens (Human)
Description:
gi_156151420
Residue:
917
  
Inhibitor
Name:
BDBM80810
Synonyms:
7-amino-6-chloro-5,8-diketo-naphthalene-2-sulfonamide 7-amino-6-chloro-5,8-dioxonaphthalene-2-sulfonamide MLS002667101 cid_240739
Type:
Small organic molecule
Emp. Form.:
C10H7ClN2O4S
Mol. Mass.:
286.692
SMILES:
NC1=C(Cl)C(=O)c2ccc(cc2C1=O)S(N)(=O)=O
: