Target
Hexokinase HKDC1 [W721R]
Ligand
BDBM42233
Substrate
Meas. Tech.
Dose Response confirmation of inhibitors of hexokinase domain containing I (HKDC1) in the hexokinase 1 selectivity assay
IC50
2850±n/a nM
Citation
 PubChem, PC Dose Response confirmation of inhibitors of hexokinase domain containing I (HKDC1) in the hexokinase 1 selectivity assay PubChem Bioassay (2011)[AID] 
Target
Name:
Hexokinase HKDC1 [W721R]
Synonyms:
HKDC1 putative hexokinase HKDC1
Type:
Enzyme Catalytic Domain
Mol. Mass.:
102520.24
Organism:
Homo sapiens (Human)
Description:
gi_156151420
Residue:
917
  
Inhibitor
Name:
BDBM42233
Synonyms:
4-ethyl-N-[(1Z)-4-oxo-3-(1H-1,2,4-triazol-3-ylthio)naphthalen-1(4H)-ylidene]benzenesulfonamide 4-ethyl-N-[4-oxidanylidene-3-(1H-1,2,4-triazol-5-ylsulfanyl)naphthalen-1-ylidene]benzenesulfonamide 4-ethyl-N-[4-oxo-3-(1H-1,2,4-triazol-5-ylthio)-1-naphthalenylidene]benzenesulfonamide SMR000207686 | cid_3318216
Type:
Small organic molecule
Emp. Form.:
C20H16N4O3S2
Mol. Mass.:
424.496
SMILES:
CCc1ccc(cc1)S(=O)(=O)N=C1C=C(Sc2nnc[nH]2)C(=O)c2ccccc12
: