Target
Hexokinase HKDC1 [W721R]
Ligand
BDBM80757
Substrate
Meas. Tech.
Dose Response confirmation of inhibitors of hexokinase domain containing I (HKDC1) in the hexokinase 1 selectivity assay
IC50
3060±n/a nM
Citation
 PubChem, PC Dose Response confirmation of inhibitors of hexokinase domain containing I (HKDC1) in the hexokinase 1 selectivity assay PubChem Bioassay (2011)[AID] 
Target
Name:
Hexokinase HKDC1 [W721R]
Synonyms:
HKDC1 putative hexokinase HKDC1
Type:
Enzyme Catalytic Domain
Mol. Mass.:
102520.24
Organism:
Homo sapiens (Human)
Description:
gi_156151420
Residue:
917
  
Inhibitor
Name:
BDBM80757
Synonyms:
MLS002701980 N-(3-chloro-1,4-dioxo-2-naphthalenyl)butanamide N-[3-chloranyl-1,4-bis(oxidanylidene)naphthalen-2-yl]butanamide cid_276685
Type:
Small organic molecule
Emp. Form.:
C14H12ClNO3
Mol. Mass.:
277.703
SMILES:
CCCC(=O)NC1=C(Cl)C(=O)c2ccccc2C1=O
: