Target
Glucose-6-phosphate 1-dehydrogenase
Ligand
BDBM32020
Substrate
Meas. Tech.
Human Glucose-6-Phosphate Dehydrogenase Dose Response Selectivity Assay for Inhibitors of Plasmodium falciparum Glucose-6-Phosphate Dehydrogenase
IC50
>80000±n/a nM
Citation
 PubChem, PC Human Glucose-6-Phosphate Dehydrogenase Dose Response Selectivity Assay for Inhibitors of Plasmodium falciparum Glucose-6-Phosphate Dehydrogenase PubChem Bioassay (2011)[AID] 
Target
Name:
Glucose-6-phosphate 1-dehydrogenase
Synonyms:
G6PD Glucose 6-phosphate dehydrogenase (G6PD) glucose-6-phosphate 1-dehydrogenase isoform b
Type:
Enzyme
Mol. Mass.:
59258.58
Organism:
Homo sapiens (Human)
Description:
P11413
Residue:
515
  
Inhibitor
Name:
BDBM32020
Synonyms:
4-[4-(3,4-dihydroxyphenyl)-2,3-dimethyl-butyl]pyrocatechol 4-[4-[3,4-bis(oxidanyl)phenyl]-2,3-dimethyl-butyl]benzene-1,2-diol CHEMBL52 MLS000069451 Nordihydroguaiaretic acid (NDGA) US10857082, Compound 2.18 | cid_4534
Type:
Small organic molecule
Emp. Form.:
C18H22O4
Mol. Mass.:
302.3649
SMILES:
CC(Cc1ccc(O)c(O)c1)C(C)Cc1ccc(O)c(O)c1
: