Target
Proto-oncogene tyrosine-protein kinase Src
Ligand
BDBM81375
Substrate
Meas. Tech.
In Vitro Activity Assay
pH
7.5±0
IC50
3.3±0.6 nM
Citation
 Ranjitkar, PBrock, AMMaly, DJ Affinity reagents that target a specific inactive form of protein kinases. Chem Biol 17:195-206 (2010)  
Target
Name:
Proto-oncogene tyrosine-protein kinase Src
Synonyms:
Proto-oncogene c-Src SRC_CHICK c-Src p60c-src | pp60c-src
Type:
Tyr protein kinase
Mol. Mass.:
60015.36
Organism:
Gallus gallus (Chicken)
Description:
P00523
Residue:
533
  
Inhibitor
Name:
BDBM81375
Synonyms:
Amine compound, 12a
Type:
Small organic molecule
Emp. Form.:
C41H46F3N9O7
Mol. Mass.:
833.8552
SMILES:
Cc1ccc(NC(=O)c2cccc(c2)C(F)(F)F)cc1Nc1ncccc1-c1ncnc(Nc2ccc(OCCNC(=O)COCCOCCOCCOCCN)cc2)n1
: