Target
Tyrosine-protein kinase HCK
Ligand
BDBM81376
Substrate
Meas. Tech.
In Vitro Activity Assay
pH
7.5±0
IC50
6.3±1.4 nM
Citation
 Ranjitkar, PBrock, AMMaly, DJ Affinity reagents that target a specific inactive form of protein kinases. Chem Biol 17:195-206 (2010)  
Target
Name:
Tyrosine-protein kinase HCK
Synonyms:
HCK Hematopoietic cell kinase p59-HCK/p60-HCK p61Hck
Type:
Enzyme Catalytic Domain
Mol. Mass.:
59600.18
Organism:
Homo sapiens (Human)
Description:
P08631
Residue:
526
  
Inhibitor
Name:
BDBM81376
Synonyms:
Amine compound, 13a
Type:
Small organic molecule
Emp. Form.:
C42H47F3N8O7
Mol. Mass.:
832.8672
SMILES:
Cc1ccc(NC(=O)c2cccc(c2)C(F)(F)F)cc1Nc1ncccc1-c1cc(Nc2ccc(OCCNC(=O)COCCOCCOCCOCCN)cc2)ncn1
: