Target
Cyclin-dependent kinase 9
Ligand
BDBM81433
Substrate
Meas. Tech.
In Vitro Kinase Assay
Ki
0.29±0.27 nM
Citation
 Wang, SGriffiths, GMidgley, CABarnett, ALCooper, MGrabarek, JIngram, LJackson, WKontopidis, GMcClue, SJMcInnes, CMcLachlan, JMeades, CMezna, MStuart, IThomas, MPZheleva, DILane, DPJackson, RCGlover, DMBlake, DGFischer, PM Discovery and characterization of 2-anilino-4- (thiazol-5-yl)pyrimidine transcriptional CDK inhibitors as anticancer agents. Chem Biol 17:1111-21 (2010)  
Target
Name:
Cyclin-dependent kinase 9
Synonyms:
C-2K CDK9 Cell division cycle 2-like protein kinase 4 Cyclin-Dependent Kinase 9 (CDK9) Serine/threonine-protein kinase PITALRE Tat-associated kinase complex catalytic subunit
Type:
Enzyme Subunit
Mol. Mass.:
42789.13
Organism:
Homo sapiens (Human)
Description:
Residue:
372
  
Inhibitor
Name:
BDBM81433
Synonyms:
CDK Inhibitor, 6
Type:
Small organic molecule
Emp. Form.:
C16H17N5O2S2
Mol. Mass.:
375.468
SMILES:
CNc1nc(C)c(s1)-c1ccnc(Nc2cccc(c2)S(C)(=O)=O)n1
: