Target
Alpha-1A adrenergic receptor
Ligand
BDBM50855
Substrate
Ki
9±n/a nM
Comments
PDSP_20638
Citation
 U'Prichard, DCGreenberg, DASnyder, SH Binding characteristics of a radiolabeled agonist and antagonist at central nervous system alpha noradrenergic receptors. Mol Pharmacol 13:454-73 (1977) Target
Name:
Alpha-1A adrenergic receptor
Synonyms:
ADA1A_RAT Adra1c Alpha-1A adrenoceptor Alpha-1C adrenergic receptor | adrenergic Alpha1A
Type:
Protein
Mol. Mass.:
51620.15
Organism:
Rattus norvegicus (Rat)
Description:
P43140
Residue:
466
  
Inhibitor
Name:
BDBM50855
Synonyms:
ALPHA-ERGOCRYPTINE SMR000058703 | cid_6852403
Type:
Small organic molecule
Emp. Form.:
C32H41N5O5
Mol. Mass.:
575.6984
SMILES:
CC(C)C[C@@H]1N2C(=O)[C@](NC(=O)[C@H]3CN(C)C4Cc5c[nH]c6cccc(C4=C3)c56)(O[C@@]2(O)C2CCCN2C1=O)C(C)C
: