Target
5-hydroxytryptamine receptor 7
Ligand
BDBM55436
Substrate
Ki
2000±n/a nM
Comments
PDSP_1893
Citation
 Greengrass, PBremner, R Binding characteristics of 3H-prazosin to rat brain alpha-adrenergic receptors. Eur J Pharmacol 55:323-6 (1979)  
Target
Name:
5-hydroxytryptamine receptor 7
Synonyms:
5-HT-7 5-HT7 5-HT7S 5-hydroxytryptamine receptor 7 5HT7R_RAT GPRFO Serotonin (5-HT) receptor | Serotonin Receptor 7
Type:
G Protein-Coupled Receptor (GPCR)
Mol. Mass.:
49852.62
Organism:
Rattus norvegicus (rat)
Description:
Rat cloned 5-HT7R.
Residue:
448
  
Inhibitor
Name:
BDBM55436
Synonyms:
2-(phenylmethyl)-4,5-dihydro-1H-imidazole;hydrochloride 2-benzyl-2-imidazoline;hydrochloride MLS000559484 Tolazoline | cid_6048
Type:
Small organic molecule
Emp. Form.:
C10H12N2
Mol. Mass.:
160.2157
SMILES:
C(C1=NCCN1)c1ccccc1
: