Target
5-hydroxytryptamine receptor 1B
Ligand
BDBM82087
Substrate
Ki
0.75±n/a nM
Comments
PDSP_172
Citation
 Hamblin, MWMetcalf, MAMcGuffin, RWKarpells, S Molecular cloning and functional characterization of a human 5-HT1B serotonin receptor: a homologue of the rat 5-HT1B receptor with 5-HT1D-like pharmacological specificity. Biochem Biophys Res Commun 184:752-9 (1992)  
Target
Name:
5-hydroxytryptamine receptor 1B
Synonyms:
5-HT-1B 5-HT1B 5HT1B_HUMAN HTR1DB Serotonin (5-HT) receptor Serotonin Receptor 1B
Type:
G Protein-Coupled Receptor (GPCR)
Mol. Mass.:
43579.17
Organism:
Homo sapiens (Human)
Description:
Receptor binding assays were performed using human clone stably expressed in CHO cells
Residue:
390
  
Inhibitor
Name:
BDBM82087
Synonyms:
2-(5-methoxy-1H-indol-3-yl)ethanamine 5-Methoxytryptamine hydrochloride tryptamine, 5-Methoxy
Type:
Small organic molecule
Emp. Form.:
C11H14N2O
Mol. Mass.:
190.2417
SMILES:
COc1ccc2[nH]cc(CCN)c2c1
: