Target
Histamine H3 receptor
Ligand
BDBM81541
Substrate
Ki
1800±n/a nM
Comments
PDSP_1677
Citation
 Hill, SJ Multiple histamine receptors: properties and functional characteristics. Biochem Soc Trans 20:122-5 (1992)  
Target
Name:
Histamine H3 receptor
Synonyms:
HISTAMINE H3 HRH3_CAVPO | Histamine H3 receptor
Type:
Enzyme Catalytic Domain
Mol. Mass.:
48753.61
Organism:
GUINEA PIG
Description:
HISTAMINE H3 HRH3 GUINEA PIG::Q9JI35
Residue:
445
  
Inhibitor
Name:
BDBM81541
Synonyms:
CAS_195530 S-Beta-Dimethylhistamine-R-alpha
Type:
Small organic molecule
Emp. Form.:
C7H13N3
Mol. Mass.:
139.1982
SMILES:
CC(N)C(C)c1cnc[nH]1
: