Target
Bis(5'-adenosyl)-triphosphatase
Ligand
BDBM81574
Substrate
Meas. Tech.
Enzyme Inhibition Assay
Ki
1500±0.0 nM
Citation
 Varnum, JMBaraniak, JKaczmarek, RStec, WJBrenner, C Di-, tri- and tetra-5'-O-phosphorothioadenosyl substituted polyols as inhibitors of Fhit: Importance of the alpha-beta bridging oxygen and beta phosphorus replacement. BMC Chem Biol 1:3 (2001)  
Target
Name:
Bis(5'-adenosyl)-triphosphatase
Synonyms:
AP3A hydrolase Bis(5'adenosyl)-triphosphatase FHIT Fragile histidine triad protein
Type:
Protein
Mol. Mass.:
16861.00
Organism:
Homo sapiens (Human)
Description:
P49789
Residue:
147
  
Inhibitor
Name:
BDBM81574
Synonyms:
AppppA analog, 5 (X=O)
Type:
Small organic molecule
Emp. Form.:
C22H28N10O16P3
Mol. Mass.:
781.4381
SMILES:
Nc1ncnc2n(cnc12)C1O[C@H](COP([O-])(=O)OCP(O)([O-])=COP([O-])(=O)OCC2O[C@H]([C@H](O)[C@@H]2O)n2cnc3c(N)ncnc23)[C@@H](O)[C@H]1O
: