Target
Urokinase-type plasminogen activator
Ligand
BDBM81598
Substrate
Meas. Tech.
Inhibition Assay
Ki
1.8e+4± 2e+3 nM
Citation
 Heynekamp, JJHunsaker, LAVander Jagt, TADeck, LMVander Jagt, DL Uncharged isocoumarin-based inhibitors of urokinase-type plasminogen activator. BMC Chem Biol 6:1 (2006)  
Target
Name:
Urokinase-type plasminogen activator
Synonyms:
PLAU UROK_HUMAN Urokinase-type plasminogen activator (uPA) | Urokinase-type plasminogen activator/surface receptor
Type:
Enzyme
Mol. Mass.:
48528.62
Organism:
Homo sapiens (Human)
Description:
P00749
Residue:
431
  
Inhibitor
Name:
BDBM81598
Synonyms:
Isocoumarin, 4e
Type:
Small organic molecule
Emp. Form.:
C13H12BrClO3
Mol. Mass.:
331.59
SMILES:
Clc1c(OCCCCBr)oc(=O)c2ccccc12
: