Target
Urokinase-type plasminogen activator
Ligand
BDBM81601
Substrate
Meas. Tech.
Inhibition Assay
Ki
1.4e+2± 2e+1 nM
Citation
 Heynekamp, JJHunsaker, LAVander Jagt, TADeck, LMVander Jagt, DL Uncharged isocoumarin-based inhibitors of urokinase-type plasminogen activator. BMC Chem Biol 6:1 (2006)  
Target
Name:
Urokinase-type plasminogen activator
Synonyms:
PLAU UROK_HUMAN Urokinase-type plasminogen activator (uPA) | Urokinase-type plasminogen activator/surface receptor
Type:
Enzyme
Mol. Mass.:
48528.62
Organism:
Homo sapiens (Human)
Description:
P00749
Residue:
431
  
Inhibitor
Name:
BDBM81601
Synonyms:
Isocoumarin, 5e
Type:
Small organic molecule
Emp. Form.:
C14H15ClN2O3S
Mol. Mass.:
326.799
SMILES:
NC(=N)SCCCCOc1oc(=O)c2ccccc2c1Cl
: