Target
Urokinase-type plasminogen activator
Ligand
BDBM81604
Substrate
Meas. Tech.
Inhibition Assay
Ki
38± 5 nM
Citation
 Heynekamp, JJHunsaker, LAVander Jagt, TADeck, LMVander Jagt, DL Uncharged isocoumarin-based inhibitors of urokinase-type plasminogen activator. BMC Chem Biol 6:1 (2006)  
Target
Name:
Urokinase-type plasminogen activator
Synonyms:
PLAU UROK_HUMAN Urokinase-type plasminogen activator (uPA) | Urokinase-type plasminogen activator/surface receptor
Type:
Enzyme
Mol. Mass.:
48528.62
Organism:
Homo sapiens (Human)
Description:
P00749
Residue:
431
  
Inhibitor
Name:
BDBM81604
Synonyms:
Isocoumarin, 7b
Type:
Small organic molecule
Emp. Form.:
C13H14ClN3O3S
Mol. Mass.:
327.787
SMILES:
NC(=N)SCCCOc1oc(=O)c2cc(N)ccc2c1Cl
: