Target
Vascular endothelial growth factor receptor 2
Ligand
BDBM50168397
Substrate
Meas. Tech.
Kinase Inhibition Assay
IC50
8±n/a nM
Citation
 Yu, HWang, ZZhang, LZhang, JHuang, Q The discovery of novel vascular endothelial growth factor receptor tyrosine kinases inhibitors: pharmacophore modeling, virtual screening and docking studies. Chem Biol Drug Des 69:204-11 (2007)  
Target
Name:
Vascular endothelial growth factor receptor 2
Synonyms:
CD_antigen=CD309 Fetal liver kinase 1 (FLK-1) KDR Protein-tyrosine kinase receptor Flk-1 VEGFR-2 VEGFR2 Vascular Endothelial Growth Factor Receptor Kinase 2 Vascular endothelial growth factor receptor 2 (KDR) Vascular endothelial growth factor receptor 2 (VEGFR2) Vascular endothelial growth factor receptor-2 (VEGFR-2)
Type:
Receptor Tyrosine Kinase
Mol. Mass.:
151510.97
Organism:
Homo sapiens (Human)
Description:
P35968
Residue:
1356
  
Inhibitor
Name:
BDBM50168397
Synonyms:
2,4-Difluoro-5-[5-isopropyl-6-(5-methyl-oxazol-2-yl)-pyrrolo[2,1-f][1,2,4]triazin-4-ylamino]-N-methoxy-benzamide CHEMBL193306 | KDR Kinase Inhibitor, 8
Type:
Small organic molecule
Emp. Form.:
C21H20F2N6O3
Mol. Mass.:
442.4187
SMILES:
CONC(=O)c1cc(Nc2ncnn3cc(-c4ncc(C)o4)c(C(C)C)c23)c(F)cc1F
: