Target
Somatostatin receptor type 3
Ligand
BDBM81766
Substrate
Ki
268±n/a nM
Comments
PDSP_1242
Citation
 Yasuda, KRens-Domiano, SBreder, CDLaw, SFSaper, CBReisine, TBell, GI Cloning of a novel somatostatin receptor, SSTR3, coupled to adenylylcyclase. J Biol Chem 267:20422-8 (1992) Target
Name:
Somatostatin receptor type 3
Synonyms:
SOMATOSTATIN SST3 SSR-28 Smstr3 Somatostatin receptor 3 Sstr3
Type:
Enzyme Catalytic Domain
Mol. Mass.:
47225.49
Organism:
MOUSE
Description:
SOMATOSTATIN SST3 SSTR3 MOUSE::P30935
Residue:
428
  
Inhibitor
Name:
BDBM81766
Synonyms:
CAS_3086456 NSC_3086456
Type:
Small organic molecule
Emp. Form.:
C44H56N8O7
Mol. Mass.:
808.9648
SMILES:
CC(C)C1NC(=O)C(CCCCN)NC(=O)C(Cc2c[nH]c3ccccc23)NC(=O)C(Cc2ccc(O)cc2)NC(=O)C(C)N(C)C(=O)C(Cc2ccccc2)NC1=O
: