Target
Muscarinic acetylcholine receptor M1
Ligand
BDBM81768
Substrate
Ki
0.035±n/a nM
Comments
PDSP_2042
Citation
 Bolden, CCusack, BRichelson, E Antagonism by antimuscarinic and neuroleptic compounds at the five cloned human muscarinic cholinergic receptors expressed in Chinese hamster ovary cells. J Pharmacol Exp Ther 260:576-80 (1992) Target
Name:
Muscarinic acetylcholine receptor M1
Synonyms:
ACM1_HUMAN Cholinergic receptor, muscarinic 1 | Cholinergic, muscarinic M1
Type:
Protein
Mol. Mass.:
51442.54
Organism:
Homo sapiens (Human)
Description:
P11229
Residue:
460
  
Inhibitor
Name:
BDBM81768
Synonyms:
BENZYLIC ACID NSC_5311391 | Quinuclidinyl benzilate
Type:
Small organic molecule
Emp. Form.:
C14H12O3
Mol. Mass.:
228.2433
SMILES:
OC(=O)C(O)(c1ccccc1)c1ccccc1
: