Target
Muscarinic acetylcholine receptor M4
Ligand
BDBM81770
Substrate
Ki
430±n/a nM
Comments
PDSP_1797
Citation
 Bolden, CCusack, BRichelson, E Antagonism by antimuscarinic and neuroleptic compounds at the five cloned human muscarinic cholinergic receptors expressed in Chinese hamster ovary cells. J Pharmacol Exp Ther 260:576-80 (1992) Target
Name:
Muscarinic acetylcholine receptor M4
Synonyms:
ACM4_HUMAN Cholinergic, muscarinic M4 Muscarinic acetylcholine receptor M2 and M4
Type:
Enzyme Catalytic Domain
Mol. Mass.:
53079.31
Organism:
Homo sapiens (Human)
Description:
Cholinergic, muscarinic M4 CHRM4 HUMAN M3::P08173
Residue:
479
  
Inhibitor
Name:
BDBM81770
Synonyms:
CAS_82650-83-7 TENILAPINE
Type:
Small organic molecule
Emp. Form.:
C17H16N4S2
Mol. Mass.:
340.466
SMILES:
CN1CCN(CC1)C1=Nc2cscc2C(=CC#N)c2cscc12
: