Target
Alpha-2A adrenergic receptor
Ligand
BDBM81773
Substrate
Ki
1.34±n/a nM
Comments
PDSP_340
Citation
 Bylund, DBBlaxall, HSIversen, LJCaron, MGLefkowitz, RJLomasney, JW Pharmacological characteristics of alpha 2-adrenergic receptors: comparison of pharmacologically defined subtypes with subtypes identified by molecular cloning. Mol Pharmacol 42:1-5 (1992) Target
Name:
Alpha-2A adrenergic receptor
Synonyms:
ADA2A_HUMAN ADRA2R Adrenergic alpha2A Alpha-2 adrenergic receptor subtype C10 Alpha-2A adrenoreceptor alpha-2A adrenergic receptor [Homo sapiens]
Type:
Enzyme
Mol. Mass.:
48979.91
Organism:
Homo sapiens (Human)
Description:
P08913
Residue:
450
  
Inhibitor
Name:
BDBM81773
Synonyms:
BAM 1303 CAS_115219-10-8
Type:
Small organic molecule
Emp. Form.:
C25H25BrN4
Mol. Mass.:
461.397
SMILES:
CN1C[C@H](Cn2ccnc2-c2ccccc2)C[C@H]2[C@H]1Cc1c(Br)[nH]c3cccc2c13
: