Target
Alpha-2A adrenergic receptor
Ligand
BDBM30993
Substrate
Ki
8.9±n/a nM
Comments
PDSP_1589
Citation
 Bylund, DBBlaxall, HSIversen, LJCaron, MGLefkowitz, RJLomasney, JW Pharmacological characteristics of alpha 2-adrenergic receptors: comparison of pharmacologically defined subtypes with subtypes identified by molecular cloning. Mol Pharmacol 42:1-5 (1992) Target
Name:
Alpha-2A adrenergic receptor
Synonyms:
ADA2A_HUMAN ADRA2R Adrenergic alpha2A Alpha-2 adrenergic receptor subtype C10 Alpha-2A adrenoreceptor alpha-2A adrenergic receptor [Homo sapiens]
Type:
Enzyme
Mol. Mass.:
48979.91
Organism:
Homo sapiens (Human)
Description:
P08913
Residue:
465
  
Inhibitor
Name:
BDBM30993
Synonyms:
Ajmalicine Raubasine cid_251561
Type:
Small organic molecule
Emp. Form.:
C21H24N2O3
Mol. Mass.:
352.4269
SMILES:
COC(=O)C1=COC(C)C2CN3CCc4c([nH]c5ccccc45)C3CC12
: