Target
5-hydroxytryptamine receptor 1E
Ligand
BDBM50016479
Substrate
Ki
43±n/a nM
Comments
PDSP_1158
Citation
 Zgombick, JMSchechter, LEMacchi, MHartig, PRBranchek, TAWeinshank, RL Human gene S31 encodes the pharmacologically defined serotonin 5-hydroxytryptamine1E receptor. Mol Pharmacol 42:180-5 (1992) Target
Name:
5-hydroxytryptamine receptor 1E
Synonyms:
5-HT-1E 5-Hydroxytryptamine Receptor Subtype 1E (5HT1E) 5-hydroxytryptamine receptor 1E (5-HT-1E) (S31) 5HT1E_HUMAN S31 Serotonin 1e (5-HT1e) receptor | Serotonin Receptor 1E
Type:
G Protein-Coupled Receptor (GPCR)
Mol. Mass.:
41697.80
Organism:
Homo sapiens (Human)
Description:
gi_112822
Residue:
365
  
Inhibitor
Name:
BDBM50016479
Synonyms:
(7-Methyl-4,6,6a,7,8,9-hexahydro-indolo[4,3-fg]quinolin-9-yl)-methanol CHEMBL39947 cid_14987
Type:
Small organic molecule
Emp. Form.:
C16H18N2O
Mol. Mass.:
254.3269
SMILES:
CN1C[C@H](CO)C=C2[C@H]1Cc1c[nH]c3cccc2c13
: