Target
Muscarinic acetylcholine receptor M1
Ligand
BDBM39341
Substrate
Ki
9±n/a nM
Comments
PDSP_1503
Citation
 McKinney, MAnderson, DJVella-Rountree, LConnolly, TMiller, JH Pharmacological profiles for rat cortical M1 and M2 muscarinic receptors using selective antagonists: comparison with N1E-115 muscarinic receptors. J Pharmacol Exp Ther 257:1121-9 (1991) Target
Name:
Muscarinic acetylcholine receptor M1
Synonyms:
ACM1_RAT Chrm-1 cholinergic receptor, muscarinic 1
Type:
Enzyme Catalytic Domain
Mol. Mass.:
51390.46
Organism:
RAT
Description:
P08482
Residue:
460
  
Inhibitor
Name:
BDBM39341
Synonyms:
11-[(4-methylpiperazin-1-yl)acetyl]-5,11-dihydro-6H-pyrido[2,3-b][1,4]benzodiazepin-6-one 11-[2-(4-methylpiperazin-1-yl)acetyl]-5H-pyrido[2,3-b][1,4]benzodiazepin-6-one;hydrochloride 11-[2-(4-methylpiperazino)acetyl]-5H-pyrido[2,3-b][1,4]benzodiazepin-6-one;hydrochloride MLS000069702 PIRENZEPINE DIHYDROCHLORIDE cid_185248
Type:
Small organic molecule
Emp. Form.:
C19H21N5O2
Mol. Mass.:
351.4023
SMILES:
CN1CCN(CC(=O)N2c3ccccc3C(=O)Nc3cccnc23)CC1
: