Target
Muscarinic acetylcholine receptor M4
Ligand
BDBM81800
Substrate
Ki
7.8±n/a nM
Comments
PDSP_1700
Citation
 McKinney, MAnderson, DJVella-Rountree, LConnolly, TMiller, JH Pharmacological profiles for rat cortical M1 and M2 muscarinic receptors using selective antagonists: comparison with N1E-115 muscarinic receptors. J Pharmacol Exp Ther 257:1121-9 (1991) Target
Name:
Muscarinic acetylcholine receptor M4
Synonyms:
ACM4_RAT Chrm-4 | Chrm4
Type:
Enzyme Catalytic Domain
Mol. Mass.:
52841.70
Organism:
RAT
Description:
Cholinergic, muscarinic M4 CHRM4 RAT::P08485
Residue:
477
  
Inhibitor
Name:
BDBM81800
Synonyms:
CAS_57558-44-8 Secoverine
Type:
Small organic molecule
Emp. Form.:
C22H35NO2
Mol. Mass.:
345.5188
SMILES:
CCN(CCCC(=O)C1CCCCC1)C(C)Cc1ccc(OC)cc1
: