Target
5-hydroxytryptamine receptor 1D
Ligand
BDBM50005835
Substrate
Ki
3.7±n/a nM
Comments
PDSP_1788
Citation
 Hamblin, MWMetcalf, MA Primary structure and functional characterization of a human 5-HT1D-type serotonin receptor. Mol Pharmacol 40:143-8 (1991) Target
Name:
5-hydroxytryptamine receptor 1D
Synonyms:
5-HT-1D 5-HT1D 5HT1D_HUMAN HTR1DA Serotonin (5-HT) receptor | Serotonin Receptor 1D
Type:
G Protein-Coupled Receptor (GPCR)
Mol. Mass.:
41920.63
Organism:
Homo sapiens (Human)
Description:
Receptor binding assays were performed using human clone stably expressed in CHO cells.
Residue:
377
  
Inhibitor
Name:
BDBM50005835
Synonyms:
(3-[2-(dimethylamino)ethyl]-1H-indol-5-yl)-N-methylmethanesulfonamide 1-{3-[2-(dimethylamino)ethyl]-1H-indol-5-yl}-N-methylmethanesulfonamide 3-[2-(dimethylamino)ethyl]-N-methylindole-5-methanesulfonamide SUMATRIPTAN Sumax
Type:
Small organic molecule
Emp. Form.:
C14H21N3O2S
Mol. Mass.:
295.4
SMILES:
CNS(=O)(=O)Cc1ccc2[nH]cc(CCN(C)C)c2c1
: