Target
Alpha-2B adrenergic receptor
Ligand
BDBM81805
Substrate
Ki
5.3±n/a nM
Comments
PDSP_338
Citation
 Blaxall, HSMurphy, TJBaker, JCRay, CBylund, DB Characterization of the alpha-2C adrenergic receptor subtype in the opossum kidney and in the OK cell line. J Pharmacol Exp Ther 259:323-9 (1991) Target
Name:
Alpha-2B adrenergic receptor
Synonyms:
ADA2B_RAT Adrenergic receptor alpha Alpha-2B adrenergic receptor Alpha-2B adrenoreceptor | adrenergic Alpha2B
Type:
Enzyme Catalytic Domain
Mol. Mass.:
50379.83
Organism:
NEONATAL RAT
Description:
adrenergic Alpha2B ADRA2B NEONATAL RAT::P19328
Residue:
453
  
Inhibitor
Name:
BDBM81805
Synonyms:
AZAPETINE NSC_8966
Type:
Small organic molecule
Emp. Form.:
C17H17N
Mol. Mass.:
235.3236
SMILES:
C=CCN1Cc2ccccc2-c2ccccc2C1
: