Target
Alpha-2C adrenergic receptor
Ligand
BDBM81802
Substrate
Ki
804±n/a nM
Comments
PDSP_505
Citation
 Blaxall, HSMurphy, TJBaker, JCRay, CBylund, DB Characterization of the alpha-2C adrenergic receptor subtype in the opossum kidney and in the OK cell line. J Pharmacol Exp Ther 259:323-9 (1991) Target
Name:
Alpha-2C adrenergic receptor
Synonyms:
ADRA2C | adrenergic Alpha2C
Type:
Enzyme Catalytic Domain
Mol. Mass.:
27257.01
Organism:
OK
Description:
adrenergic Alpha2C ADRA2C OK::G3GWB4
Residue:
230
  
Inhibitor
Name:
BDBM81802
Synonyms:
CAS_81382-52-7 CGS10746B | PENTIAPINE MALEATE
Type:
Small organic molecule
Emp. Form.:
C15H17N5S
Mol. Mass.:
299.394
SMILES:
CN1CCN(CC1)C1=Nc2ccccc2Sc2nccn12
: