Target
Pituitary adenylate cyclase-activating polypeptide
Ligand
BDBM81828
Substrate
Ki
1000±n/a nM
Comments
PDSP_2122
Citation
 Schäfer, HSchwarzhoff, RCreutzfeldt, WSchmidt, WE Characterization of a guanosine-nucleotide-binding-protein-coupled receptor for pituitary adenylate-cyclase-activating polypeptide on plasma membranes from rat brain. Eur J Biochem 202:951-8 (1991)  
Target
Name:
Pituitary adenylate cyclase-activating polypeptide
Synonyms:
Adcyap1 PACAP-27 PACA_RAT | Pituitary adenylate cyclase-activating polypeptide
Type:
Enzyme Catalytic Domain
Mol. Mass.:
19565.66
Organism:
RAT
Description:
PACAP 0 RAT::P13589
Residue:
175
  
Inhibitor
Name:
BDBM81828
Synonyms:
CAS_37221-79-7 Vasoactive intestinal polypeptide
Type:
Small organic molecule
Emp. Form.:
C147H237N43O43S
Mol. Mass.:
3326.782
SMILES:
CCC(C)C(NC(=O)C(CO)NC(=O)C(CC(N)=O)NC(=O)C(CC(C)C)NC(=O)C(Cc1ccc(O)cc1)NC(=O)C(CCCCN)NC(=O)C(CCCCN)NC(=O)C(NC(=O)C(C)NC(=O)C(CCSC)NC(=O)C(CCC(N)=O)NC(=O)C(CCCCN)NC(=O)C(CCCN=C(N)N)NC(=O)C(CC(C)C)NC(=O)C(CCCN=C(N)N)NC(=O)C(NC(=O)C(Cc1ccc(O)cc1)NC(=O)C(CC(N)=O)NC(=O)C(CC(O)=O)NC(=O)C(NC(=O)C(Cc1ccccc1)NC(=O)C(NC(=O)C(C)NC(=O)C(CC(O)=O)NC(=O)C(CO)NC(=O)C(N)Cc1cnc[nH]1)C(C)C)C(C)O)C(C)O)C(C)C)C(=O)NC(CC(C)C)C(=O)NC(CC(N)=O)C(O)=O
: